Target
72 kDa type IV collagenase
Ligand
BDBM50062331
Substrate
Meas. Tech.
ChEMBL_104542 (CHEMBL718929)
Ki
0.52±n/a nM
Citation
 Levy, DELapierre, FLiang, WYe, WLange, CWLi, XGrobelny, DCasabonne, MTyrrell, DHolme, KNadzan, AGalardy, RE Matrix metalloproteinase inhibitors: a structure-activity study. J Med Chem 41:199-223 (1998)  
Target
Name:
72 kDa type IV collagenase
Synonyms:
72 kDa gelatinase CLG4A Gelatinase A (MMP-2) MMP2_HUMAN Matrix metalloproteinase-2 (MMP 2) Matrix metalloproteinases 2 (MMP-2) | TBE-1
Type:
Enzyme
Mol. Mass.:
73870.36
Organism:
Homo sapiens (Human)
Description:
P08253
Residue:
660
  
Inhibitor
Name:
BDBM50062331
Synonyms:
(R)-N*4*-Hydroxy-N*1*-[(S)-1-[2-(4-hydroxy-phenyl)-ethylcarbamoyl]-2-(1H-indol-3-yl)-ethyl]-2-isobutyl-succinamide | CHEMBL306524
Type:
Small organic molecule
Emp. Form.:
C27H34N4O5
Mol. Mass.:
494.5827
SMILES:
CC(C)C[C@H](CC(=O)NO)C(=O)N[C@@H](Cc1c[nH]c2ccccc12)C(=O)NCCc1ccc(O)cc1
: