Target
Neutrophil collagenase
Ligand
BDBM50062332
Substrate
Meas. Tech.
ChEMBL_105205 (CHEMBL713844)
Ki
0.49±n/a nM
Citation
 Levy, DELapierre, FLiang, WYe, WLange, CWLi, XGrobelny, DCasabonne, MTyrrell, DHolme, KNadzan, AGalardy, RE Matrix metalloproteinase inhibitors: a structure-activity study. J Med Chem 41:199-223 (1998)  
Target
Name:
Neutrophil collagenase
Synonyms:
CLG1 MMP8 Matrix metalloproteinase-8 PMNL collagenase | PMNL-CL
Type:
Enzyme
Mol. Mass.:
53413.48
Organism:
Homo sapiens (Human)
Description:
P22894
Residue:
467
  
Inhibitor
Name:
BDBM50062332
Synonyms:
(R)-N*1*-[(S)-1-[(Furan-2-ylmethyl)-carbamoyl]-2-(1H-indol-3-yl)-ethyl]-N*4*-hydroxy-2-isobutyl-succinamide | CHEMBL72788
Type:
Small organic molecule
Emp. Form.:
C24H30N4O5
Mol. Mass.:
454.5188
SMILES:
CC(C)C[C@H](CC(=O)NO)C(=O)N[C@@H](Cc1c[nH]c2ccccc12)C(=O)NCc1ccco1
: