Target
Neutrophil collagenase
Ligand
BDBM50062342
Substrate
Meas. Tech.
ChEMBL_105205 (CHEMBL713844)
Ki
0.64±n/a nM
Citation
 Levy, DELapierre, FLiang, WYe, WLange, CWLi, XGrobelny, DCasabonne, MTyrrell, DHolme, KNadzan, AGalardy, RE Matrix metalloproteinase inhibitors: a structure-activity study. J Med Chem 41:199-223 (1998)  
Target
Name:
Neutrophil collagenase
Synonyms:
CLG1 MMP8 Matrix metalloproteinase-8 PMNL collagenase | PMNL-CL
Type:
Enzyme
Mol. Mass.:
53413.48
Organism:
Homo sapiens (Human)
Description:
P22894
Residue:
467
  
Inhibitor
Name:
BDBM50062342
Synonyms:
(R)-N*4*-Hydroxy-2-isobutyl-N*1*-((R)-1-methylcarbamoyl-2-naphthalen-1-yl-ethyl)-succinamide | CHEMBL70492
Type:
Small organic molecule
Emp. Form.:
C22H29N3O4
Mol. Mass.:
399.4834
SMILES:
CNC(=O)[C@@H](Cc1cccc2ccccc12)NC(=O)[C@H](CC(C)C)CC(=O)NO
: