Target
Neutrophil collagenase
Ligand
BDBM50062327
Substrate
Meas. Tech.
ChEMBL_105205 (CHEMBL713844)
Ki
0.65±n/a nM
Citation
 Levy, DELapierre, FLiang, WYe, WLange, CWLi, XGrobelny, DCasabonne, MTyrrell, DHolme, KNadzan, AGalardy, RE Matrix metalloproteinase inhibitors: a structure-activity study. J Med Chem 41:199-223 (1998)  
Target
Name:
Neutrophil collagenase
Synonyms:
CLG1 MMP8 Matrix metalloproteinase-8 PMNL collagenase | PMNL-CL
Type:
Enzyme
Mol. Mass.:
53413.48
Organism:
Homo sapiens (Human)
Description:
P22894
Residue:
467
  
Inhibitor
Name:
BDBM50062327
Synonyms:
(R)-N*4*-Hydroxy-2-isobutyl-N*1*-((R)-3-methyl-1-methylcarbamoyl-butyl)-succinamide | CHEMBL70570
Type:
Small organic molecule
Emp. Form.:
C15H29N3O4
Mol. Mass.:
315.4085
SMILES:
CNC(=O)[C@@H](CC(C)C)NC(=O)[C@H](CC(C)C)CC(=O)NO
: