Target
Neutrophil collagenase
Ligand
BDBM50062311
Substrate
Meas. Tech.
ChEMBL_105205 (CHEMBL713844)
Ki
0.3±n/a nM
Citation
 Levy, DELapierre, FLiang, WYe, WLange, CWLi, XGrobelny, DCasabonne, MTyrrell, DHolme, KNadzan, AGalardy, RE Matrix metalloproteinase inhibitors: a structure-activity study. J Med Chem 41:199-223 (1998)  
Target
Name:
Neutrophil collagenase
Synonyms:
CLG1 MMP8 Matrix metalloproteinase-8 PMNL collagenase | PMNL-CL
Type:
Enzyme
Mol. Mass.:
53413.48
Organism:
Homo sapiens (Human)
Description:
P22894
Residue:
467
  
Inhibitor
Name:
BDBM50062311
Synonyms:
(R)-N*4*-Hydroxy-2-isobutyl-N*1*-[(R)-1-(3-morpholin-4-yl-propylcarbamoyl)-2-naphthalen-1-yl-ethyl]-succinamide | CHEMBL70430
Type:
Small organic molecule
Emp. Form.:
C28H40N4O5
Mol. Mass.:
512.641
SMILES:
CC(C)C[C@H](CC(=O)NO)C(=O)N[C@H](Cc1cccc2ccccc12)C(=O)NCCCN1CCOCC1
: