Target
72 kDa type IV collagenase
Ligand
BDBM50062353
Substrate
Meas. Tech.
ChEMBL_104542 (CHEMBL718929)
Ki
0.52±n/a nM
Citation
 Levy, DELapierre, FLiang, WYe, WLange, CWLi, XGrobelny, DCasabonne, MTyrrell, DHolme, KNadzan, AGalardy, RE Matrix metalloproteinase inhibitors: a structure-activity study. J Med Chem 41:199-223 (1998)  
Target
Name:
72 kDa type IV collagenase
Synonyms:
72 kDa gelatinase CLG4A Gelatinase A (MMP-2) MMP2_HUMAN Matrix metalloproteinase-2 (MMP 2) Matrix metalloproteinases 2 (MMP-2) | TBE-1
Type:
Enzyme
Mol. Mass.:
73870.36
Organism:
Homo sapiens (Human)
Description:
P08253
Residue:
660
  
Inhibitor
Name:
BDBM50062353
Synonyms:
(R)-N*4*-Hydroxy-N*1*-{(S)-2-(1H-indol-3-yl)-1-[(pyridin-3-ylmethyl)-carbamoyl]-ethyl}-2-isobutyl-succinamide | CHEMBL70417
Type:
Small organic molecule
Emp. Form.:
C25H31N5O4
Mol. Mass.:
465.5447
SMILES:
CC(C)C[C@H](CC(=O)NO)C(=O)N[C@@H](Cc1c[nH]c2ccccc12)C(=O)NCc1cccnc1
: