Target
cAMP-specific 3',5'-cyclic phosphodiesterase 4C
Ligand
BDBM14361
Substrate
Meas. Tech.
ChEMBL_155175 (CHEMBL761822)
IC50
2630±n/a nM
Citation
 Kleinman, EFCampbell, EGiordano, LACohan, VLJenkinson, THCheng, JBShirley, JTPettipher, ERSalter, EDHibbs, TADiCapua, FMBordner, J Striking effect of hydroxamic acid substitution on the phosphodiesterase type 4 (PDE4) and TNF alpha inhibitory activity of two series of rolipram analogues: implications for a new active site model of PDE4. J Med Chem 41:266-70 (1998)  
Target
Name:
cAMP-specific 3',5'-cyclic phosphodiesterase 4C
Synonyms:
3',5'-cyclic phosphodiesterase NP_000914.2 PDE4C | PDE4C1
Type:
Enzyme Catalytic Domain
Mol. Mass.:
79875.54
Organism:
Homo sapiens (Human)
Description:
Q08493
Residue:
712
  
Inhibitor
Name:
BDBM14361
Synonyms:
(R,S)-Rolipram 4-[3-(cyclopentyloxy)-4-methoxyphenyl]pyrrolidin-2-one CHEMBL63 | Rolipram
Type:
Small organic molecule
Emp. Form.:
C16H21NO3
Mol. Mass.:
275.3428
SMILES:
COc1ccc(cc1OC1CCCC1)C1CNC(=O)C1
: