Target
Metabotropic glutamate receptor 2
Ligand
BDBM50408693
Substrate
Meas. Tech.
ChEMBL_106038 (CHEMBL717361)
IC50
850±n/a nM
Citation
 Ornstein, PLBleisch, TJArnold, MBWright, RAJohnson, BGSchoepp, DD 2-Substituted (2SR)-2-amino-2-((1SR,2SR)-2-carboxycycloprop-1-yl)glycines as potent and selective antagonists of group II metabotropic glutamate receptors. 1. Effects of alkyl, arylalkyl, and diarylalkyl substitution. J Med Chem 41:346-57 (1998)  
Target
Name:
Metabotropic glutamate receptor 2
Synonyms:
GPRC1B GRM2_HUMAN Metabotropic glutamate receptor mGlu2 | metabotropic glutamate 2
Type:
Enzyme
Mol. Mass.:
95584.88
Organism:
Homo sapiens (Human)
Description:
Q14416
Residue:
872
  
Inhibitor
Name:
BDBM50408693
Synonyms:
CHEMBL2112582
Type:
Small organic molecule
Emp. Form.:
C14H17NO4
Mol. Mass.:
263.2891
SMILES:
NC(CCc1ccccc1)([C@H]1C[C@@H]1C(O)=O)C(O)=O
: