Target
Muscarinic acetylcholine receptor M1
Ligand
BDBM50062582
Substrate
Meas. Tech.
ChEMBL_138689 (CHEMBL747656)
IC50
158±n/a nM
Citation
 Ward, JSMerritt, LCalligaro, DOBymaster, FPShannon, HEMitch, CHWhitesitt, CBrunsting, DSheardown, MJOlesen, PHSwedberg, MDJeppesen, LSauerberg, P 1,2,5-Thiadiazole analogues of aceclidine as potent m1 muscarinic agonists. J Med Chem 41:379-92 (1998)  
Target
Name:
Muscarinic acetylcholine receptor M1
Synonyms:
ACM1_RAT Chrm-1 cholinergic receptor, muscarinic 1
Type:
Enzyme Catalytic Domain
Mol. Mass.:
51390.46
Organism:
RAT
Description:
P08482
Residue:
460
  
Inhibitor
Name:
BDBM50062582
Synonyms:
3-Butoxy-4-(pyrrolidin-3-yloxy)-[1,2,5]thiadiazole | CHEMBL129474
Type:
Small organic molecule
Emp. Form.:
C10H17N3O2S
Mol. Mass.:
243.326
SMILES:
CCCCOc1nsnc1OC1CCNC1
: