Target
Muscarinic acetylcholine receptor M1
Ligand
BDBM50062583
Substrate
Meas. Tech.
ChEMBL_138688 (CHEMBL749925)
IC50
91±n/a nM
Citation
 Ward, JSMerritt, LCalligaro, DOBymaster, FPShannon, HEMitch, CHWhitesitt, CBrunsting, DSheardown, MJOlesen, PHSwedberg, MDJeppesen, LSauerberg, P 1,2,5-Thiadiazole analogues of aceclidine as potent m1 muscarinic agonists. J Med Chem 41:379-92 (1998)  
Target
Name:
Muscarinic acetylcholine receptor M1
Synonyms:
ACM1_RAT Chrm-1 cholinergic receptor, muscarinic 1
Type:
Enzyme Catalytic Domain
Mol. Mass.:
51390.46
Organism:
RAT
Description:
P08482
Residue:
460
  
Inhibitor
Name:
BDBM50062583
Synonyms:
3-(4-Butoxy-furazan-3-yloxy)-1-aza-bicyclo[2.2.2]octane | CHEMBL340624
Type:
Small organic molecule
Emp. Form.:
C13H21N3O3
Mol. Mass.:
267.3241
SMILES:
CCCCOc1nonc1OC1CN2CCC1CC2
: