Target
Muscarinic acetylcholine receptor M1
Ligand
BDBM50062580
Substrate
Meas. Tech.
ChEMBL_138688 (CHEMBL749925)
IC50
44±n/a nM
Citation
 Ward, JSMerritt, LCalligaro, DOBymaster, FPShannon, HEMitch, CHWhitesitt, CBrunsting, DSheardown, MJOlesen, PHSwedberg, MDJeppesen, LSauerberg, P 1,2,5-Thiadiazole analogues of aceclidine as potent m1 muscarinic agonists. J Med Chem 41:379-92 (1998)  
Target
Name:
Muscarinic acetylcholine receptor M1
Synonyms:
ACM1_RAT Chrm-1 cholinergic receptor, muscarinic 1
Type:
Enzyme Catalytic Domain
Mol. Mass.:
51390.46
Organism:
RAT
Description:
P08482
Residue:
460
  
Inhibitor
Name:
BDBM50062580
Synonyms:
3-Butoxy-4-(1-methyl-pyrrolidin-3-yloxy)-[1,2,5]thiadiazole | CHEMBL129781
Type:
Small organic molecule
Emp. Form.:
C11H19N3O2S
Mol. Mass.:
257.352
SMILES:
CCCCOc1nsnc1OC1CCN(C)C1
: