Target
Muscarinic acetylcholine receptor M1
Ligand
BDBM50062582
Substrate
Meas. Tech.
ChEMBL_139210 (CHEMBL745685)
EC50
4867.0±n/a nM
Citation
 Ward, JSMerritt, LCalligaro, DOBymaster, FPShannon, HEMitch, CHWhitesitt, CBrunsting, DSheardown, MJOlesen, PHSwedberg, MDJeppesen, LSauerberg, P 1,2,5-Thiadiazole analogues of aceclidine as potent m1 muscarinic agonists. J Med Chem 41:379-92 (1998)  
Target
Name:
Muscarinic acetylcholine receptor M1
Synonyms:
ACM1_HUMAN Cholinergic receptor, muscarinic 1 | Cholinergic, muscarinic M1
Type:
Protein
Mol. Mass.:
51442.54
Organism:
Homo sapiens (Human)
Description:
P11229
Residue:
460
  
Inhibitor
Name:
BDBM50062582
Synonyms:
3-Butoxy-4-(pyrrolidin-3-yloxy)-[1,2,5]thiadiazole | CHEMBL129474
Type:
Small organic molecule
Emp. Form.:
C10H17N3O2S
Mol. Mass.:
243.326
SMILES:
CCCCOc1nsnc1OC1CCNC1
: