Target
Muscarinic acetylcholine receptor M1
Ligand
BDBM50062578
Substrate
Meas. Tech.
ChEMBL_138688 (CHEMBL749925)
IC50
44.5±n/a nM
Citation
 Ward, JSMerritt, LCalligaro, DOBymaster, FPShannon, HEMitch, CHWhitesitt, CBrunsting, DSheardown, MJOlesen, PHSwedberg, MDJeppesen, LSauerberg, P 1,2,5-Thiadiazole analogues of aceclidine as potent m1 muscarinic agonists. J Med Chem 41:379-92 (1998)  
Target
Name:
Muscarinic acetylcholine receptor M1
Synonyms:
ACM1_RAT Chrm-1 cholinergic receptor, muscarinic 1
Type:
Enzyme Catalytic Domain
Mol. Mass.:
51390.46
Organism:
RAT
Description:
P08482
Residue:
460
  
Inhibitor
Name:
BDBM50062578
Synonyms:
3-(4-Propoxy-[1,2,5]thiadiazol-3-yloxy)-1-aza-bicyclo[2.2.2]octane | CHEMBL126193
Type:
Small organic molecule
Emp. Form.:
C12H19N3O2S
Mol. Mass.:
269.363
SMILES:
CCCOc1nsnc1OC1CN2CCC1CC2
: