Target
Muscarinic acetylcholine receptor M1
Ligand
BDBM50062575
Substrate
Meas. Tech.
ChEMBL_138689 (CHEMBL747656)
IC50
20±n/a nM
Citation
 Ward, JSMerritt, LCalligaro, DOBymaster, FPShannon, HEMitch, CHWhitesitt, CBrunsting, DSheardown, MJOlesen, PHSwedberg, MDJeppesen, LSauerberg, P 1,2,5-Thiadiazole analogues of aceclidine as potent m1 muscarinic agonists. J Med Chem 41:379-92 (1998)  
Target
Name:
Muscarinic acetylcholine receptor M1
Synonyms:
ACM1_RAT Chrm-1 cholinergic receptor, muscarinic 1
Type:
Enzyme Catalytic Domain
Mol. Mass.:
51390.46
Organism:
RAT
Description:
P08482
Residue:
460
  
Inhibitor
Name:
BDBM50062575
Synonyms:
3-(4-Ethoxy-[1,2,5]thiadiazol-3-yloxy)-1-aza-bicyclo[2.2.2]octane | CHEMBL339081
Type:
Small organic molecule
Emp. Form.:
C11H17N3O2S
Mol. Mass.:
255.337
SMILES:
CCOc1nsnc1OC1CN2CCC1CC2
: