Target
D(2) dopamine receptor
Ligand
BDBM50063280
Substrate
Meas. Tech.
ChEMBL_60370 (CHEMBL672206)
Ki
12±n/a nM
Citation
 Wustrow, DBelliotti, TGlase, SKesten, SRJohnson, DColbry, NRubin, RBlackburn, AAkunne, HCorbin, ADavis, MDGeorgic, LWhetzel, SZoski, KHeffner, TPugsley, TWise, L Aminopyrimidines with high affinity for both serotonin and dopamine receptors. J Med Chem 41:760-71 (1998)  
Target
Name:
D(2) dopamine receptor
Synonyms:
D(2) dopamine receptor DOPAMINE D2 Long DRD2 Dopamine D2 receptor Dopamine D2 receptor (D2R) Dopamine2-like | d2
Type:
Cell-surface receptors
Mol. Mass.:
50647.10
Organism:
Homo sapiens (Human)
Description:
P14416
Residue:
443
  
Inhibitor
Name:
BDBM50063280
Synonyms:
CHEMBL355371 | {4-[2-(4-Pyridin-2-yl-piperazin-1-yl)-ethyl]-cyclohexyl}-pyrimidin-2-yl-amine
Type:
Small organic molecule
Emp. Form.:
C21H30N6
Mol. Mass.:
366.5031
SMILES:
C(CN1CCN(CC1)c1ccccn1)[C@H]1CC[C@@H](CC1)Nc1ncccn1
: