Target
D(3) dopamine receptor
Ligand
BDBM50063282
Substrate
Meas. Tech.
ChEMBL_62432 (CHEMBL674835)
Ki
160±n/a nM
Citation
 Wustrow, DBelliotti, TGlase, SKesten, SRJohnson, DColbry, NRubin, RBlackburn, AAkunne, HCorbin, ADavis, MDGeorgic, LWhetzel, SZoski, KHeffner, TPugsley, TWise, L Aminopyrimidines with high affinity for both serotonin and dopamine receptors. J Med Chem 41:760-71 (1998)  
Target
Name:
D(3) dopamine receptor
Synonyms:
DOPAMINE D3 DRD3_HUMAN Dopamine D3 receptor (D3) Dopamine receptor Dopamine receptor D3
Type:
Mol. Mass.:
44243.43
Organism:
Homo sapiens (Human)
Description:
Residue:
400
  
Inhibitor
Name:
BDBM50063282
Synonyms:
CHEMBL2110308 | {4-[2-(4-Phenyl-piperazin-1-yl)-ethyl]-cyclohexyl}-pyrimidin-2-yl-amine
Type:
Small organic molecule
Emp. Form.:
C20H27N5
Mol. Mass.:
337.4619
SMILES:
C1CC(CCC1Nc1ncccn1)N1CCN(CC1)c1ccccc1
: