Target
D(3) dopamine receptor
Ligand
BDBM50063298
Substrate
Meas. Tech.
ChEMBL_62432 (CHEMBL674835)
Ki
5±n/a nM
Citation
 Wustrow, DBelliotti, TGlase, SKesten, SRJohnson, DColbry, NRubin, RBlackburn, AAkunne, HCorbin, ADavis, MDGeorgic, LWhetzel, SZoski, KHeffner, TPugsley, TWise, L Aminopyrimidines with high affinity for both serotonin and dopamine receptors. J Med Chem 41:760-71 (1998)  
Target
Name:
D(3) dopamine receptor
Synonyms:
DOPAMINE D3 DRD3_HUMAN Dopamine D3 receptor (D3) Dopamine receptor Dopamine receptor D3
Type:
Mol. Mass.:
44243.43
Organism:
Homo sapiens (Human)
Description:
Residue:
400
  
Inhibitor
Name:
BDBM50063298
Synonyms:
(4-{2-[4-(2,3-Dichloro-phenyl)-piperazin-1-yl]-ethyl}-cyclohexyl)-pyrimidin-2-yl-amine | CHEMBL350352
Type:
Small organic molecule
Emp. Form.:
C22H29Cl2N5
Mol. Mass.:
434.405
SMILES:
Clc1cccc(N2CCN(CC[C@H]3CC[C@@H](CC3)Nc3ncccn3)CC2)c1Cl
: