Target
Polyunsaturated fatty acid 5-lipoxygenase
Ligand
BDBM50063779
Substrate
Meas. Tech.
ChEMBL_168 (CHEMBL615380)
IC50
12000±n/a nM
Citation
 Janusz, JMYoung, PAScherz, MWEnzweiler, KWu, LIGan, LPikul, SMcDow-Dunham, KLJohnson, CRSenanayake, CBKellstein, DEGreen, SATulich, JLRosario-Jansen, TMagrisso, IJWehmeyer, KRKuhlenbeck, DLEichhold, THDobson, RL New cyclooxygenase-2/5-lipoxygenase inhibitors. 2. 7-tert-butyl-2,3-dihydro-3,3-dimethylbenzofuran derivatives as gastrointestinal safe antiinflammatory and analgesic agents: variations of the dihydrobenzofuran ring. J Med Chem 41:1124-37 (1998)  
Target
Name:
Polyunsaturated fatty acid 5-lipoxygenase
Synonyms:
Alox5 LOX5_RAT
Type:
PROTEIN
Mol. Mass.:
78082.31
Organism:
Rattus norvegicus
Description:
ChEMBL_1432947
Residue:
673
  
Inhibitor
Name:
BDBM50063779
Synonyms:
1-(7-tert-Butyl-3,3-dimethyl-2,3-dihydro-benzofuran-5-yl)-pentan-1-one | CHEMBL13661
Type:
Small organic molecule
Emp. Form.:
C19H28O2
Mol. Mass.:
288.4244
SMILES:
CCCCC(=O)c1cc2c(OCC2(C)C)c(c1)C(C)(C)C
: