Target
Sigma non-opioid intracellular receptor 1
Ligand
BDBM50063800
Substrate
Meas. Tech.
ChEMBL_200983 (CHEMBL801236)
Ki
0.6±n/a nM
Citation
 Ucar, HVan derpoorten, KCacciaguerra, SSpampinato, SStables, JPDepovere, PIsa, MMasereel, BDelarge, JPoupaert, JH Synthesis and anticonvulsant activity of 2(3H)-benzoxazolone and 2(3H)-benzothiazolone derivatives. J Med Chem 41:1138-45 (1998)  
Target
Name:
Sigma non-opioid intracellular receptor 1
Synonyms:
Aging-associated gene 8 protein SGMR1_HUMAN SIGMAR1 SR31747-binding protein Sigma 1-type opioid receptor Sigma1R | hSigmaR1
Type:
Enzyme Catalytic Domain
Mol. Mass.:
25124.85
Organism:
Homo sapiens (Human)
Description:
Q99720
Residue:
223
  
Inhibitor
Name:
BDBM50063800
Synonyms:
3-(2-Piperidin-1-yl-ethyl)-6-propyl-3H-benzothiazol-2-one | CHEMBL274699
Type:
Small organic molecule
Emp. Form.:
C17H24N2OS
Mol. Mass.:
304.45
SMILES:
CCCc1ccc2n(CCN3CCCCC3)c(=O)sc2c1
: