Target
Alpha-1A adrenergic receptor
Ligand
BDBM50063906
Substrate
Meas. Tech.
ChEMBL_34028 (CHEMBL646016)
Ki
580±n/a nM
Citation
 Patane, MAScott, ALBroten, TPChang, RSRansom, RWDiSalvo, JForray, CBock, MG 4-Amino-2-[4-[1-(benzyloxycarbonyl)-2(S)- [[(1,1-dimethylethyl)amino]carbonyl]-piperazinyl]-6, 7-dimethoxyquinazoline (L-765,314): a potent and selective alpha1b adrenergic receptor antagonist. J Med Chem 41:1205-8 (1998)  
Target
Name:
Alpha-1A adrenergic receptor
Synonyms:
ADA1A_RAT Adra1c Alpha-1A adrenoceptor Alpha-1C adrenergic receptor | adrenergic Alpha1A
Type:
Protein
Mol. Mass.:
51620.15
Organism:
Rattus norvegicus (Rat)
Description:
P43140
Residue:
466
  
Inhibitor
Name:
BDBM50063906
Synonyms:
(S)-4-(4-Amino-6,7-dimethoxy-quinazolin-2-yl)-1-(furan-2-carbonyl)-piperazine-2-carboxylic acid tert-butylamide | CHEMBL19826
Type:
Small organic molecule
Emp. Form.:
C24H30N6O5
Mol. Mass.:
482.5322
SMILES:
COc1cc2nc(nc(N)c2cc1OC)N1CCN([C@@H](C1)C(=O)NC(C)(C)C)C(=O)c1ccco1
: