Target
Alpha-1B adrenergic receptor
Ligand
BDBM50063908
Substrate
Meas. Tech.
ChEMBL_34632 (CHEMBL647277)
IC50
2700±n/a nM
Citation
 Patane, MAScott, ALBroten, TPChang, RSRansom, RWDiSalvo, JForray, CBock, MG 4-Amino-2-[4-[1-(benzyloxycarbonyl)-2(S)- [[(1,1-dimethylethyl)amino]carbonyl]-piperazinyl]-6, 7-dimethoxyquinazoline (L-765,314): a potent and selective alpha1b adrenergic receptor antagonist. J Med Chem 41:1205-8 (1998)  
Target
Name:
Alpha-1B adrenergic receptor
Synonyms:
ADA1B_RAT Alpha 1B-adrenoceptor Alpha adrenergic receptor 1A and 1B Alpha-1Adrenoceptor Alpha-1B adrenoreceptor | adrenergic Alpha1B
Type:
G Protein-Coupled Receptor (GPCR)
Mol. Mass.:
56606.71
Organism:
Rattus norvegicus (rat)
Description:
Receptor binding assays were performed using rat cortical membranes.
Residue:
515
  
Inhibitor
Name:
BDBM50063908
Synonyms:
(S)-4-(4-Amino-6,7-dimethoxy-quinazolin-2-yl)-piperazine-2-carboxylic acid tert-butylamide | CHEMBL19376
Type:
Small organic molecule
Emp. Form.:
C19H28N6O3
Mol. Mass.:
388.464
SMILES:
COc1cc2nc(nc(N)c2cc1OC)N1CCN[C@@H](C1)C(=O)NC(C)(C)C
: