Target
Alpha-1A adrenergic receptor
Ligand
BDBM50063908
Substrate
Meas. Tech.
ChEMBL_33601 (CHEMBL652809)
IC50
1700±n/a nM
Citation
 Patane, MAScott, ALBroten, TPChang, RSRansom, RWDiSalvo, JForray, CBock, MG 4-Amino-2-[4-[1-(benzyloxycarbonyl)-2(S)- [[(1,1-dimethylethyl)amino]carbonyl]-piperazinyl]-6, 7-dimethoxyquinazoline (L-765,314): a potent and selective alpha1b adrenergic receptor antagonist. J Med Chem 41:1205-8 (1998)  
Target
Name:
Alpha-1A adrenergic receptor
Synonyms:
ADA1A_HUMAN ADRA1C Alpha 1A-adrenoceptor Alpha adrenergic receptor 1a Alpha-adrenergic receptor 1c adrenergic Alpha1 | adrenergic Alpha1C
Type:
Cell-surface receptors
Mol. Mass.:
51511.67
Organism:
Homo sapiens (Human)
Description:
P35348
Residue:
466
  
Inhibitor
Name:
BDBM50063908
Synonyms:
(S)-4-(4-Amino-6,7-dimethoxy-quinazolin-2-yl)-piperazine-2-carboxylic acid tert-butylamide | CHEMBL19376
Type:
Small organic molecule
Emp. Form.:
C19H28N6O3
Mol. Mass.:
388.464
SMILES:
COc1cc2nc(nc(N)c2cc1OC)N1CCN[C@@H](C1)C(=O)NC(C)(C)C
: