Target
Alpha-1D adrenergic receptor
Ligand
BDBM50026917
Substrate
Meas. Tech.
ChEMBL_32730 (CHEMBL646001)
Ki
2.4±n/a nM
Citation
 Patane, MAScott, ALBroten, TPChang, RSRansom, RWDiSalvo, JForray, CBock, MG 4-Amino-2-[4-[1-(benzyloxycarbonyl)-2(S)- [[(1,1-dimethylethyl)amino]carbonyl]-piperazinyl]-6, 7-dimethoxyquinazoline (L-765,314): a potent and selective alpha1b adrenergic receptor antagonist. J Med Chem 41:1205-8 (1998)  
Target
Name:
Alpha-1D adrenergic receptor
Synonyms:
ADA1D_RAT Adra1d Alpha-1D adrenergic receptor | Serotonin 1a (5-HT1a) receptor/Adrenergic receptor alpha-1
Type:
Protein
Mol. Mass.:
59375.97
Organism:
Rattus norvegicus (Rat)
Description:
P23944
Residue:
561
  
Inhibitor
Name:
BDBM50026917
Synonyms:
8-(2-(4-(2-methoxyphenyl)piperazin-1-yl)ethyl)-8-azaspiro[4.5]decane-7,9-dione 8-{2-[4-(2-Methoxy-phenyl)-piperazin-1-yl]-ethyl}-8-aza-spiro[4.5]decane-7,9-dione BMY 7378 CHEMBL1256934 CHEMBL543741
Type:
Small organic molecule
Emp. Form.:
C22H31N3O3
Mol. Mass.:
385.4998
SMILES:
COc1ccccc1N1CCN(CCN2C(=O)CC3(CCCC3)CC2=O)CC1
: