Target
Somatostatin receptor type 4
Ligand
BDBM50064030
Substrate
Meas. Tech.
ChEMBL_200515 (CHEMBL801019)
Ki
2000±n/a nM
Citation
 Hirschmann, RHynes, JCichy-Knight, MAvan Rijn, RDSprengeler, PASpoors, PGShakespeare, WCPietranico-Cole, SBarbosa, JLiu, JYao, WRohrer, SSmith, AB Modulation of receptor and receptor subtype affinities using diastereomeric and enantiomeric monosaccharide scaffolds as a means to structural and biological diversity. A new route to ether synthesis. J Med Chem 41:1382-91 (1998)  
Target
Name:
Somatostatin receptor type 4
Synonyms:
SOMATOSTATIN SST4 SS4-R SSR4_HUMAN SSTR4 | Somatostatin receptor type 4 (SSTR4)
Type:
Enzyme
Mol. Mass.:
42015.38
Organism:
Homo sapiens (Human)
Description:
P31391
Residue:
388
  
Inhibitor
Name:
BDBM50064030
Synonyms:
5-((2R,3R,4S,5R,6R)-3,4,5-Tris-benzyloxy-6-methoxy-tetrahydro-pyran-2-ylmethoxy)-pentylamine | CHEMBL29102
Type:
Small organic molecule
Emp. Form.:
C33H43NO6
Mol. Mass.:
549.6976
SMILES:
CO[C@@H]1O[C@H](COCCCCCN)[C@@H](OCc2ccccc2)[C@H](OCc2ccccc2)[C@H]1OCc1ccccc1
: