Target
Bifunctional dihydrofolate reductase-thymidylate synthase
Ligand
BDBM50041179
Substrate
Meas. Tech.
ChEMBL_53476 (CHEMBL665601)
IC50
700±n/a nM
Citation
 Gangjee, AElzein, EQueener, SFMcGuire, JJ Synthesis and biological activities of tricyclic conformationally restricted tetrahydropyrido annulated furo[2,3-d]pyrimidines as inhibitors of dihydrofolate reductases. J Med Chem 41:1409-16 (1998)  
Target
Name:
Bifunctional dihydrofolate reductase-thymidylate synthase
Synonyms:
DHFR-TS Dihydrofolate reductase Dihydrofolate reductase; T. gondii vs rat
Type:
Enzyme
Mol. Mass.:
68757.49
Organism:
Toxoplasma gondii
Description:
Q07422
Residue:
610
  
Inhibitor
Name:
BDBM50041179
Synonyms:
2-{4-[(2,4-Diamino-furo[2,3-d]pyrimidin-5-ylmethyl)-amino]-benzoylamino}-pentanedioic acid | CHEMBL17383
Type:
Small organic molecule
Emp. Form.:
C19H20N6O6
Mol. Mass.:
428.3987
SMILES:
Nc1nc(N)c2c(CNc3ccc(cc3)C(=O)NC(CCC(O)=O)C(O)=O)coc2n1
: