Target
Sigma non-opioid intracellular receptor 1
Ligand
BDBM50064172
Substrate
Meas. Tech.
ChEMBL_200978 (CHEMBL802065)
Ki
0.5±n/a nM
Citation
 Quaglia, WGiannella, MPiergentili, APigini, MBrasili, LDi Toro, RRossetti, LSpampinato, SMelchiorre, C 1'-Benzyl-3,4-dihydrospiro[2H-1- benzothiopyran-2,4'-piperidine] (spipethiane), a potent and highly selective sigma1 ligand. J Med Chem 41:1557-60 (1998)  
Target
Name:
Sigma non-opioid intracellular receptor 1
Synonyms:
Aging-associated gene 8 protein SGMR1_HUMAN SIGMAR1 SR31747-binding protein Sigma 1-type opioid receptor Sigma1R | hSigmaR1
Type:
Enzyme Catalytic Domain
Mol. Mass.:
25124.85
Organism:
Homo sapiens (Human)
Description:
Q99720
Residue:
223
  
Inhibitor
Name:
BDBM50064172
Synonyms:
1-benzylspiro[hexahydropyridine-4,2'-(3',4'-dihydro-2'H-thiochromene)] SPIPETHIANE
Type:
Small organic molecule
Emp. Form.:
C20H23NS
Mol. Mass.:
309.468
SMILES:
C(N1CCC2(CC1)CCc1ccccc1S2)c1ccccc1
: