Target
Beta-2 adrenergic receptor
Ligand
BDBM50064223
Substrate
Meas. Tech.
ChEMBL_38607 (CHEMBL652290)
IC50
>10000±n/a nM
Citation
 Blanc, MTamir, AAubriot, SMichel, MCBouzoubaa, MLeclerc, GDemenge, P Synthesis and adrenergic activity of a new series of N-aryl dicyclopropyl ketone oxime ethers: SAR and stereochemical aspects. J Med Chem 41:1613-8 (1998)  
Target
Name:
Beta-2 adrenergic receptor
Synonyms:
ADRB2 | ADRB2_CANLF
Type:
PROTEIN
Mol. Mass.:
46593.67
Organism:
Canis familiaris
Description:
ChEMBL_56504
Residue:
415
  
Inhibitor
Name:
BDBM50064223
Synonyms:
CHEMBL40272 | Dicyclopropyl-methanone O-[2-hydroxy-3-(pyridin-2-ylamino)-propyl]-oxime
Type:
Small organic molecule
Emp. Form.:
C15H21N3O2
Mol. Mass.:
275.3461
SMILES:
OC(CNc1ccccn1)CON=C(C1CC1)C1CC1
: