Target
Retinoic acid receptor RXR-gamma
Ligand
BDBM50064253
Substrate
Meas. Tech.
ChEMBL_196601 (CHEMBL799679)
EC50
>2000±n/a nM
Citation
 Muccio, DDBrouillette, WJBreitman, TRTaimi, MEmanuel, PDZhang, XChen, GSani, BPVenepally, PReddy, LAlam, MSimpson-Herren, LHill, DL Conformationally defined retinoic acid analogues. 4. Potential new agents for acute promyelocytic and juvenile myelomonocytic leukemias. J Med Chem 41:1679-87 (1998)  
Target
Name:
Retinoic acid receptor RXR-gamma
Synonyms:
Nr2b3 Retinoid X receptor gamma | Rxrg
Type:
PROTEIN
Mol. Mass.:
50900.28
Organism:
Mus musculus
Description:
ChEMBL_196589
Residue:
463
  
Inhibitor
Name:
BDBM50064253
Synonyms:
(2E,4Z,6Z)-8-[3,4-Dihydro-2H-naphthalen-(1E)-ylidene]-3,7-dimethyl-octa-2,4,6-trienoic acid | CHEMBL44979
Type:
Small organic molecule
Emp. Form.:
C20H22O2
Mol. Mass.:
294.3875
SMILES:
C\C(\C=C/C=C(/C)\C=C1/CCCc2ccccc12)=C/C(O)=O
: