Target
Retinoic acid receptor RXR-alpha
Ligand
BDBM50064250
Substrate
Meas. Tech.
ChEMBL_196493 (CHEMBL798307)
EC50
>2000±n/a nM
Citation
 Muccio, DDBrouillette, WJBreitman, TRTaimi, MEmanuel, PDZhang, XChen, GSani, BPVenepally, PReddy, LAlam, MSimpson-Herren, LHill, DL Conformationally defined retinoic acid analogues. 4. Potential new agents for acute promyelocytic and juvenile myelomonocytic leukemias. J Med Chem 41:1679-87 (1998)  
Target
Name:
Retinoic acid receptor RXR-alpha
Synonyms:
Nr2b1 Retinoid X receptor alpha | Rxra
Type:
PROTEIN
Mol. Mass.:
51225.80
Organism:
Mus musculus
Description:
ChEMBL_196493
Residue:
467
  
Inhibitor
Name:
BDBM50064250
Synonyms:
(2E,4E,6E)-8-[3,4-Dihydro-2H-naphthalen-(1E)-ylidene]-3,7-dimethyl-octa-2,4,6-trienoic acid CHEMBL46397
Type:
Small organic molecule
Emp. Form.:
C20H22O2
Mol. Mass.:
294.3875
SMILES:
C\C(\C=C\C=C(/C)\C=C1/CCCc2ccccc12)=C/C(O)=O
: