Target
All-trans-retinol dehydrogenase [NAD(+)] ADH1B
Ligand
BDBM50064267
Substrate
Meas. Tech.
ChEMBL_31169 (CHEMBL641134)
Ki
4900000±n/a nM
Citation
 Schindler, JFBerst, KBPlapp, BV Inhibition of human alcohol dehydrogenases by formamides. J Med Chem 41:1696-701 (1998)  
Target
Name:
All-trans-retinol dehydrogenase [NAD(+)] ADH1B
Synonyms:
ADH1B ADH2 Alcohol dehydrogenase beta chain
Type:
PROTEIN
Mol. Mass.:
39864.68
Organism:
Homo sapiens (Human)
Description:
ChEMBL_31169
Residue:
375
  
Inhibitor
Name:
BDBM50064267
Synonyms:
CHEMBL297125 | N,N-Dicyclobutyl-formamide
Type:
Small organic molecule
Emp. Form.:
C9H15NO
Mol. Mass.:
153.2215
SMILES:
O=CN(C1CCC1)C1CCC1
: