Target
Alcohol dehydrogenase 1A
Ligand
BDBM50064269
Substrate
Meas. Tech.
ChEMBL_31168 (CHEMBL646633)
Ki
7200±n/a nM
Citation
 Schindler, JFBerst, KBPlapp, BV Inhibition of human alcohol dehydrogenases by formamides. J Med Chem 41:1696-701 (1998)  
Target
Name:
Alcohol dehydrogenase 1A
Synonyms:
ADH1 ADH1A_HUMAN Alcohol dehydrogenase 1A Alcohol dehydrogenase subunit alpha
Type:
PROTEIN
Mol. Mass.:
39866.36
Organism:
Homo sapiens (Human)
Description:
ChEMBL_31168
Residue:
375
  
Inhibitor
Name:
BDBM50064269
Synonyms:
CHEMBL45466 | N-Butyl-formamide
Type:
Small organic molecule
Emp. Form.:
C5H11NO
Mol. Mass.:
101.1469
SMILES:
CCCCNC=O
: