Target
Alcohol dehydrogenase 1C
Ligand
BDBM50064275
Substrate
Meas. Tech.
ChEMBL_31170 (CHEMBL641135)
Ki
120000±n/a nM
Citation
 Schindler, JFBerst, KBPlapp, BV Inhibition of human alcohol dehydrogenases by formamides. J Med Chem 41:1696-701 (1998)  
Target
Name:
Alcohol dehydrogenase 1C
Synonyms:
ADH1C ADH3 Alcohol dehydrogenase gamma chain
Type:
PROTEIN
Mol. Mass.:
39877.25
Organism:
Homo sapiens (Human)
Description:
ChEMBL_31170
Residue:
375
  
Inhibitor
Name:
BDBM50064275
Synonyms:
CHEMBL297216 | N-Propyl-formamide
Type:
Small organic molecule
Emp. Form.:
C4H9NO
Mol. Mass.:
87.1204
SMILES:
CCCNC=O
: