Target
All-trans-retinol dehydrogenase [NAD(+)] ADH1B
Ligand
BDBM50064285
Substrate
Meas. Tech.
ChEMBL_31169 (CHEMBL641134)
Ki
250000±n/a nM
Citation
 Schindler, JFBerst, KBPlapp, BV Inhibition of human alcohol dehydrogenases by formamides. J Med Chem 41:1696-701 (1998)  
Target
Name:
All-trans-retinol dehydrogenase [NAD(+)] ADH1B
Synonyms:
ADH1B ADH2 Alcohol dehydrogenase beta chain
Type:
PROTEIN
Mol. Mass.:
39864.68
Organism:
Homo sapiens (Human)
Description:
ChEMBL_31169
Residue:
375
  
Inhibitor
Name:
BDBM50064285
Synonyms:
CHEMBL294911 | N-Cyclohexyl-N-cyclopropyl-formamide
Type:
Small organic molecule
Emp. Form.:
C10H17NO
Mol. Mass.:
167.2481
SMILES:
O=CN(C1CC1)C1CCCCC1
: