Target
All-trans-retinol dehydrogenase [NAD(+)] ADH7
Ligand
BDBM50064275
Substrate
Meas. Tech.
ChEMBL_31173 (CHEMBL641138)
Ki
21000±n/a nM
Citation
 Schindler, JFBerst, KBPlapp, BV Inhibition of human alcohol dehydrogenases by formamides. J Med Chem 41:1696-701 (1998)  
Target
Name:
All-trans-retinol dehydrogenase [NAD(+)] ADH7
Synonyms:
ADH7 Alcohol dehydrogenase Alcohol dehydrogenase class IV Gastric alcohol dehydrogenase | Retinol dehydrogenase
Type:
PROTEIN
Mol. Mass.:
41487.40
Organism:
Homo sapiens (Human)
Description:
ChEMBL_31175
Residue:
386
  
Inhibitor
Name:
BDBM50064275
Synonyms:
CHEMBL297216 | N-Propyl-formamide
Type:
Small organic molecule
Emp. Form.:
C4H9NO
Mol. Mass.:
87.1204
SMILES:
CCCNC=O
: