Target
Alcohol dehydrogenase 1A
Ligand
BDBM50064286
Substrate
Meas. Tech.
ChEMBL_31168 (CHEMBL646633)
Ki
360±n/a nM
Citation
 Schindler, JFBerst, KBPlapp, BV Inhibition of human alcohol dehydrogenases by formamides. J Med Chem 41:1696-701 (1998)  
Target
Name:
Alcohol dehydrogenase 1A
Synonyms:
ADH1 ADH1A_HUMAN Alcohol dehydrogenase 1A Alcohol dehydrogenase subunit alpha
Type:
PROTEIN
Mol. Mass.:
39866.36
Organism:
Homo sapiens (Human)
Description:
ChEMBL_31168
Residue:
375
  
Inhibitor
Name:
BDBM50064286
Synonyms:
CHEMBL45844 N-Cyclobutyl-N-cyclopentyl-formamide
Type:
Small organic molecule
Emp. Form.:
C10H17NO
Mol. Mass.:
167.2481
SMILES:
O=CN(C1CCC1)C1CCCC1
: