Target
Alcohol dehydrogenase 1C
Ligand
BDBM50064269
Substrate
Meas. Tech.
ChEMBL_31170 (CHEMBL641135)
Ki
100000±n/a nM
Citation
 Schindler, JFBerst, KBPlapp, BV Inhibition of human alcohol dehydrogenases by formamides. J Med Chem 41:1696-701 (1998)  
Target
Name:
Alcohol dehydrogenase 1C
Synonyms:
ADH1C ADH3 Alcohol dehydrogenase gamma chain
Type:
PROTEIN
Mol. Mass.:
39877.25
Organism:
Homo sapiens (Human)
Description:
ChEMBL_31170
Residue:
375
  
Inhibitor
Name:
BDBM50064269
Synonyms:
CHEMBL45466 | N-Butyl-formamide
Type:
Small organic molecule
Emp. Form.:
C5H11NO
Mol. Mass.:
101.1469
SMILES:
CCCCNC=O
: