Target
All-trans-retinol dehydrogenase [NAD(+)] ADH4
Ligand
BDBM50064277
Substrate
Meas. Tech.
ChEMBL_31171 (CHEMBL641136)
Ki
120000±n/a nM
Citation
 Schindler, JFBerst, KBPlapp, BV Inhibition of human alcohol dehydrogenases by formamides. J Med Chem 41:1696-701 (1998)  
Target
Name:
All-trans-retinol dehydrogenase [NAD(+)] ADH4
Synonyms:
ADH2 ADH4_HUMAN Alcohol dehydrogenase class II
Type:
PROTEIN
Mol. Mass.:
40228.36
Organism:
Homo sapiens (Human)
Description:
ChEMBL_31171
Residue:
380
  
Inhibitor
Name:
BDBM50064277
Synonyms:
CHEMBL45705 | N-Cyclohexyl-N-methyl-formamide
Type:
Small organic molecule
Emp. Form.:
C8H15NO
Mol. Mass.:
141.2108
SMILES:
CN(C=O)C1CCCCC1
: