Target
Alcohol dehydrogenase 1C
Ligand
BDBM50064267
Substrate
Meas. Tech.
ChEMBL_31170 (CHEMBL641135)
Ki
19000±n/a nM
Citation
 Schindler, JFBerst, KBPlapp, BV Inhibition of human alcohol dehydrogenases by formamides. J Med Chem 41:1696-701 (1998)  
Target
Name:
Alcohol dehydrogenase 1C
Synonyms:
ADH1C ADH3 Alcohol dehydrogenase gamma chain
Type:
PROTEIN
Mol. Mass.:
39877.25
Organism:
Homo sapiens (Human)
Description:
ChEMBL_31170
Residue:
375
  
Inhibitor
Name:
BDBM50064267
Synonyms:
CHEMBL297125 | N,N-Dicyclobutyl-formamide
Type:
Small organic molecule
Emp. Form.:
C9H15NO
Mol. Mass.:
153.2215
SMILES:
O=CN(C1CCC1)C1CCC1
: