Target
Alcohol dehydrogenase 1C
Ligand
BDBM50064277
Substrate
Meas. Tech.
ChEMBL_31170 (CHEMBL641135)
Ki
40000±n/a nM
Citation
 Schindler, JFBerst, KBPlapp, BV Inhibition of human alcohol dehydrogenases by formamides. J Med Chem 41:1696-701 (1998)  
Target
Name:
Alcohol dehydrogenase 1C
Synonyms:
ADH1C ADH3 Alcohol dehydrogenase gamma chain
Type:
PROTEIN
Mol. Mass.:
39877.25
Organism:
Homo sapiens (Human)
Description:
ChEMBL_31170
Residue:
375
  
Inhibitor
Name:
BDBM50064277
Synonyms:
CHEMBL45705 | N-Cyclohexyl-N-methyl-formamide
Type:
Small organic molecule
Emp. Form.:
C8H15NO
Mol. Mass.:
141.2108
SMILES:
CN(C=O)C1CCCCC1
: