Target
Alpha-1A adrenergic receptor
Ligand
BDBM50064590
Substrate
Meas. Tech.
ChEMBL_33583 (CHEMBL647134)
IC50
45±n/a nM
Citation
 Taverne, TDiouf, ODepreux, PPoupaert, JHLesieur, DGuardiola-Lemaître, BRenard, PRettori, MCCaignard, DHPfeiffer, B Novel benzothiazolin-2-one and benzoxazin-3-one arylpiperazine derivatives with mixed 5HT1A/D2 affinity as potential atypical antipsychotics. J Med Chem 41:2010-8 (1998)  
Target
Name:
Alpha-1A adrenergic receptor
Synonyms:
ADA1A_BOVIN ADRA1C Alpha 1A-adrenoreceptor Cerebral cortex alpha adrenergic receptor | adrenergic Alpha1
Type:
Enzyme Catalytic Domain
Mol. Mass.:
51492.08
Organism:
CALF
Description:
adrenergic Alpha1 0 CALF
Residue:
466
  
Inhibitor
Name:
BDBM50064590
Synonyms:
6-{4-[4-(3-Trifluoromethyl-phenyl)-piperazin-1-yl]-butyl}-3H-benzothiazol-2-one | CHEMBL64845
Type:
Small organic molecule
Emp. Form.:
C22H24F3N3OS
Mol. Mass.:
435.506
SMILES:
FC(F)(F)c1cccc(c1)N1CCN(CCCCc2ccc3[nH]c(=O)sc3c2)CC1
: