Target
Alpha-1A adrenergic receptor
Ligand
BDBM50064576
Substrate
Meas. Tech.
ChEMBL_33583 (CHEMBL647134)
IC50
0.5±n/a nM
Citation
 Taverne, TDiouf, ODepreux, PPoupaert, JHLesieur, DGuardiola-Lemaître, BRenard, PRettori, MCCaignard, DHPfeiffer, B Novel benzothiazolin-2-one and benzoxazin-3-one arylpiperazine derivatives with mixed 5HT1A/D2 affinity as potential atypical antipsychotics. J Med Chem 41:2010-8 (1998)  
Target
Name:
Alpha-1A adrenergic receptor
Synonyms:
ADA1A_BOVIN ADRA1C Alpha 1A-adrenoreceptor Cerebral cortex alpha adrenergic receptor | adrenergic Alpha1
Type:
Enzyme Catalytic Domain
Mol. Mass.:
51492.08
Organism:
CALF
Description:
adrenergic Alpha1 0 CALF
Residue:
466
  
Inhibitor
Name:
BDBM50064576
Synonyms:
7-{2-[4-(2-Methoxy-phenyl)-piperazin-1-yl]-ethyl}-4-methyl-4H-benzo[1,4]oxazin-3-one | CHEMBL304438
Type:
Small organic molecule
Emp. Form.:
C22H27N3O3
Mol. Mass.:
381.4681
SMILES:
COc1ccccc1N1CCN(CCc2ccc3N(C)C(=O)COc3c2)CC1
: