Target
5-hydroxytryptamine receptor 2A
Ligand
BDBM50064703
Substrate
Meas. Tech.
ChEMBL_2285 (CHEMBL617071)
Ki
0.48±n/a nM
Citation
 Monte, APMarona-Lewicka, DLewis, MMMailman, RBWainscott, DBNelson, DLNichols, DE Substituted naphthofurans as hallucinogenic phenethylamine-ergoline hybrid molecules with unexpected muscarinic antagonist activity. J Med Chem 41:2134-45 (1998)  
Target
Name:
5-hydroxytryptamine receptor 2A
Synonyms:
5-HT-2 5-HT2A 5-hydroxytryptamine receptor 2A (5HT-2A) 5HT2A_HUMAN HTR2A | Serotonin receptor 2A
Type:
undefined
Mol. Mass.:
52607.65
Organism:
Homo sapiens (Human)
Description:
P28223
Residue:
471
  
Inhibitor
Name:
BDBM50064703
Synonyms:
(R)-2-(8-Bromo-2,3,6,7-tetrahydro-benzo[1,2-b;4,5-b']difuran-4-yl)-1-methyl-ethylamine | CHEMBL305275
Type:
Small organic molecule
Emp. Form.:
C13H16BrNO2
Mol. Mass.:
298.176
SMILES:
C[C@@H](N)Cc1c2CCOc2c(Br)c2CCOc12
: