Target
Oxytocin receptor
Ligand
BDBM50064718
Substrate
Meas. Tech.
ChEMBL_149175 (CHEMBL762090)
Ki
36±n/a nM
Citation
 Bell, IMErb, JMFreidinger, RMGallicchio, SNGuare, JPGuidotti, MTHalpin, RAHobbs, DWHomnick, CFKuo, MSLis, EVMathre, DJMichelson, SRPawluczyk, JMPettibone, DJReiss, DRVickers, SWilliams, PDWoyden, CJ Development of orally active oxytocin antagonists: studies on 1-(1-[4-[1-(2-methyl-1-oxidopyridin-3-ylmethyl)piperidin-4-yloxy]-2- methoxybenzoyl]piperidin-4-yl)-1,4-dihydrobenz[d][1,3]oxazin-2-one (L-372,662) and related pyridines. J Med Chem 41:2146-63 (1998)  
Target
Name:
Oxytocin receptor
Synonyms:
OT-R Otr Oxytocin
Type:
Enzyme Catalytic Domain
Mol. Mass.:
42889.28
Organism:
RAT
Description:
Oxytocin OXTR RAT::P70536
Residue:
388
  
Inhibitor
Name:
BDBM50064718
Synonyms:
1-{1-[2-Methoxy-4-(1-pyridin-2-ylmethyl-piperidin-4-yloxy)-benzoyl]-piperidin-4-yl}-1,4-dihydro-benzo[d][1,3]oxazin-2-one | CHEMBL66567
Type:
Small organic molecule
Emp. Form.:
C32H36N4O5
Mol. Mass.:
556.652
SMILES:
COc1cc(OC2CCN(Cc3ccccn3)CC2)ccc1C(=O)N1CCC(CC1)N1C(=O)OCc2ccccc12
: