Target
5-hydroxytryptamine receptor 1D
Ligand
BDBM50051562
Substrate
Meas. Tech.
ChEMBL_1650 (CHEMBL616742)
Ki
6.7±n/a nM
Citation
 Ennis, MDGhazal, NBHoffman, RLSmith, MWSchlachter, SKLawson, CFIm, WBPregenzer, JFSvensson, KALewis, RAHall, EDSutter, DMHarris, LTMcCall, RB Isochroman-6-carboxamides as highly selective 5-HT1D agonists: potential new treatment for migraine without cardiovascular side effects. J Med Chem 41:2180-3 (1998)  
Target
Name:
5-hydroxytryptamine receptor 1D
Synonyms:
5-HT-1D 5-HT1D 5HT1D_HUMAN HTR1DA Serotonin (5-HT) receptor | Serotonin Receptor 1D
Type:
G Protein-Coupled Receptor (GPCR)
Mol. Mass.:
41920.63
Organism:
Homo sapiens (Human)
Description:
Receptor binding assays were performed using human clone stably expressed in CHO cells.
Residue:
377
  
Inhibitor
Name:
BDBM50051562
Synonyms:
1-(2-Isochroman-1-yl-ethyl)-4-(4-methoxy-phenyl)-piperazine | CHEMBL71724
Type:
Small organic molecule
Emp. Form.:
C22H28N2O2
Mol. Mass.:
352.4699
SMILES:
COc1ccc(cc1)N1CCN(CCC2OCCc3ccccc23)CC1
: