Target
Gag-Pol polyprotein [489-587]
Ligand
BDBM157
Substrate
Meas. Tech.
ChEMBL_157733 (CHEMBL765171)
Ki
0.066±n/a nM
Citation
 De Lucca, GVKim, UTLiang, JCordova, BKlabe, RMGarber, SBacheler, LTLam, GNWright, MRLogue, KAErickson-Viitanen, SKo, SSTrainor, GL Nonsymmetric P2/P2' cyclic urea HIV protease inhibitors. Structure-activity relationship, bioavailability, and resistance profile of monoindazole-substituted P2 analogues. J Med Chem 41:2411-23 (1998)  
Target
Name:
Gag-Pol polyprotein [489-587]
Synonyms:
Human immunodeficiency virus type 1 protease Pol polyprotein | gag-pol
Type:
Enzyme Subunit
Mol. Mass.:
10781.16
Organism:
Human immunodeficiency virus type 1
Description:
P04585[489-587]
Residue:
99
  
Inhibitor
Name:
BDBM157
Synonyms:
3-{[(4R,5S,6S,7R)-4,7-dibenzyl-5,6-dihydroxy-3-{[3-(methylcarbamoyl)phenyl]methyl}-2-oxo-1,3-diazepan-1-yl]methyl}-N-methylbenzamide Cyclic Urea
Type:
Emp. Form.:
C37H40N4O5
Mol. Mass.:
620.7373
SMILES:
CNC(=O)c1cccc(CN2[C@H](Cc3ccccc3)[C@H](O)[C@@H](O)[C@@H](Cc3ccccc3)N(Cc3cccc(c3)C(=O)NC)C2=O)c1
: