Target
Gag-Pol polyprotein [489-587]
Ligand
BDBM50065081
Substrate
Meas. Tech.
ChEMBL_157733 (CHEMBL765171)
Ki
0.081±n/a nM
Citation
 De Lucca, GVKim, UTLiang, JCordova, BKlabe, RMGarber, SBacheler, LTLam, GNWright, MRLogue, KAErickson-Viitanen, SKo, SSTrainor, GL Nonsymmetric P2/P2' cyclic urea HIV protease inhibitors. Structure-activity relationship, bioavailability, and resistance profile of monoindazole-substituted P2 analogues. J Med Chem 41:2411-23 (1998)  
Target
Name:
Gag-Pol polyprotein [489-587]
Synonyms:
Human immunodeficiency virus type 1 protease Pol polyprotein | gag-pol
Type:
Enzyme Subunit
Mol. Mass.:
10781.16
Organism:
Human immunodeficiency virus type 1
Description:
P04585[489-587]
Residue:
99
  
Inhibitor
Name:
BDBM50065081
Synonyms:
(4R,5S,6S,7R)-4,7-Dibenzyl-5,6-dihydroxy-1-(1H-indazol-5-ylmethyl)-3-[3-(1H-[1,2,3]triazol-2-ylmethyl)-benzyl]-[1,3]diazepan-2-one | CHEMBL309238
Type:
Small organic molecule
Emp. Form.:
C37H37N7O3
Mol. Mass.:
627.7348
SMILES:
O[C@@H]1[C@@H](O)[C@@H](Cc2ccccc2)N(Cc2ccc3[nH]ncc3c2)C(=O)N(Cc2cccc(Cn3nccn3)c2)[C@@H]1Cc1ccccc1
: