Target
Gag-Pol polyprotein [489-587]
Ligand
BDBM50065090
Substrate
Meas. Tech.
ChEMBL_157733 (CHEMBL765171)
Ki
0.048±n/a nM
Citation
 De Lucca, GVKim, UTLiang, JCordova, BKlabe, RMGarber, SBacheler, LTLam, GNWright, MRLogue, KAErickson-Viitanen, SKo, SSTrainor, GL Nonsymmetric P2/P2' cyclic urea HIV protease inhibitors. Structure-activity relationship, bioavailability, and resistance profile of monoindazole-substituted P2 analogues. J Med Chem 41:2411-23 (1998)  
Target
Name:
Gag-Pol polyprotein [489-587]
Synonyms:
Human immunodeficiency virus type 1 protease Pol polyprotein | gag-pol
Type:
Enzyme Subunit
Mol. Mass.:
10781.16
Organism:
Human immunodeficiency virus type 1
Description:
P04585[489-587]
Residue:
99
  
Inhibitor
Name:
BDBM50065090
Synonyms:
3-[(4R,5S,6S,7R)-4,7-Dibenzyl-5,6-dihydroxy-3-(1H-indazol-5-ylmethyl)-2-oxo-[1,3]diazepan-1-ylmethyl]-N-(5-methyl-pyridin-2-yl)-benzamide | CHEMBL310691
Type:
Small organic molecule
Emp. Form.:
C41H40N6O4
Mol. Mass.:
680.7941
SMILES:
Cc1ccc(NC(=O)c2cccc(CN3[C@H](Cc4ccccc4)[C@H](O)[C@@H](O)[C@@H](Cc4ccccc4)N(Cc4ccc5[nH]ncc5c4)C3=O)c2)nc1
: