Target
Vasopressin V2 receptor
Ligand
BDBM50065115
Substrate
Meas. Tech.
ChEMBL_215173 (CHEMBL821346)
IC50
1.2±n/a nM
Citation
 Albright, JDReich, MFDelos Santos, EGDusza, JPSum, FWVenkatesan, AMCoupet, JChan, PSRu, XMazandarani, HBailey, T 5-Fluoro-2-methyl-N-[4-(5H-pyrrolo[2,1-c]-[1, 4]benzodiazepin-10(11H)-ylcarbonyl)-3-chlorophenyl]benzamide (VPA-985): an orally active arginine vasopressin antagonist with selectivity for V2 receptors. J Med Chem 41:2442-4 (1998)  
Target
Name:
Vasopressin V2 receptor
Synonyms:
ADHR AVPR2 DIR Renal-type arginine vasopressin receptor V2R_HUMAN Vasopressin V2 receptor | Vasopressin receptor
Type:
Receptor
Mol. Mass.:
40295.28
Organism:
Homo sapiens (Human)
Description:
P30518
Residue:
371
  
Inhibitor
Name:
BDBM50065115
Synonyms:
3-chloro-4-(10,11-dihydro-5H-benzo[e]pyrrolo[1,2-a][1,4]diazepin-10-ylcarbonyl)-1-(5-fluoro-2-methylphenylcarboxamido)benzene Lixivaptan | N-[4-(5H,11H-Benzo[e]pyrrolo[1,2-a][1,4]diazepine-10-carbonyl)-3-chloro-phenyl]-5-fluoro-2-methyl-benzamide
Type:
Small organic molecule
Emp. Form.:
C27H21ClFN3O2
Mol. Mass.:
473.926
SMILES:
Cc1ccc(F)cc1C(=O)Nc1ccc(C(=O)N2Cc3cccn3Cc3ccccc23)c(Cl)c1
: