Target
Receptor tyrosine-protein kinase erbB-4
Ligand
BDBM50205268
Substrate
Meas. Tech.
ChEMBL_1842451 (CHEMBL4342878)
IC50
4.0±n/a nM
Citation
 Das, DHong, J Recent advancements of 4-aminoquinazoline derivatives as kinase inhibitors and their applications in medicinal chemistry. Eur J Med Chem 170:55-72 (2019)  
Target
Name:
Receptor tyrosine-protein kinase erbB-4
Synonyms:
ERBB4 Epidermal growth factor receptor ErbB-4 (HER4) Tyrosine Kinase Proto-oncogene c-ErbB-4 Receptor protein-tyrosine kinase erbB-4 Tyrosine kinase-type cell surface receptor HER4 (HER4)
Type:
Protein
Mol. Mass.:
146803.56
Organism:
Homo sapiens (Human)
Description:
Q15303
Residue:
1308
  
Inhibitor
Name:
BDBM50205268
Synonyms:
ARRY-334543 ASLAN-001 | Varlitinib
Type:
Small organic molecule
Emp. Form.:
C22H19ClN6O2S
Mol. Mass.:
466.943
SMILES:
C[C@@H]1COC(Nc2ccc3ncnc(Nc4ccc(OCc5nccs5)c(Cl)c4)c3c2)=N1
: