Target
Receptor tyrosine-protein kinase erbB-2
Ligand
BDBM50065292
Substrate
Meas. Tech.
ChEMBL_78751 (CHEMBL686676)
IC50
>100000±n/a nM
Citation
 Sun, LTran, NTang, FApp, HHirth, PMcMahon, GTang, C Synthesis and biological evaluations of 3-substituted indolin-2-ones: a novel class of tyrosine kinase inhibitors that exhibit selectivity toward particular receptor tyrosine kinases. J Med Chem 41:2588-603 (1998)  
Target
Name:
Receptor tyrosine-protein kinase erbB-2
Synonyms:
2.7.10.1 CD_antigen=CD340 ERBB2_HUMAN FASN/HER2 HER2 MLN19 NEU Proto-oncogene Neu Tyrosine kinase-type cell surface receptor HER2 | p185erbB2
Type:
Mol. Mass.:
137894.47
Organism:
Homo sapiens (Human)
Description:
P04626
Residue:
1255
  
Inhibitor
Name:
BDBM50065292
Synonyms:
(Z)-3-(3,5-Dimethyl-1H-pyrrol-2-ylmethylene)-5-methyl-1,3-dihydro-indol-2-one 3-[1-(3,5-Dimethyl-1H-pyrrol-2-yl)-meth-(Z)-ylidene]-5-methyl-1,3-dihydro-indol-2-one | CHEMBL89483
Type:
Small organic molecule
Emp. Form.:
C16H16N2O
Mol. Mass.:
252.311
SMILES:
Cc1cc(C)c(\C=C2/C(=O)Nc3ccc(C)cc23)[nH]1
: